Rooney Apprentice


Joined: 07 Aug 2003 Posts: 193 Location: Sheffield, UK
|
Posted: Tue Nov 02, 2004 8:21 am Post subject: emerge world or other package |
|
|
im constantly getting this error, does any one have any ideas.
: undefined reference to `string_in_line'
nodes.o(.text+0xbca): In function `get_tags_of_indirect_tags_table':
: undefined reference to `find_node_separator'
nodes.o(.text+0xfb8): In function `info_node_of_file_buffer_tags':
: undefined reference to `skip_node_separator'
nodes.o(.text+0x12e1): In function `adjust_nodestart':
: undefined reference to `find_node_separator'
nodes.o(.text+0x12f3): In function `adjust_nodestart':
: undefined reference to `skip_node_separator'
nodes.o(.text+0x1333): In function `adjust_nodestart':
: undefined reference to `find_node_in_binding'
nodes.o(.text+0x134d): In function `adjust_nodestart':
: undefined reference to `skip_node_separator'
nodes.o(.text+0x1387): In function `adjust_nodestart':
: undefined reference to `string_in_line'
nodes.o(.text+0x13a2): In function `adjust_nodestart':
: undefined reference to `skip_whitespace'
nodes.o(.text+0x13ba): In function `adjust_nodestart':
: undefined reference to `skip_node_characters'
session.o(.text+0x2fc2): In function `info_find_menu':
: undefined reference to `search'
session.o(.text+0x4555): In function `dump_node_to_stream':
: undefined reference to `string_in_line'
session.o(.text+0x4923): In function `info_search_in_node':
: undefined reference to `search'
collect2: ld returned 1 exit status
gcc -O2 -march=pentium4 -fomit-frame-pointer -o infokey infokey.o key.o ../l
ib/libtxi.a -lncurses
make[3]: *** [ginfo] Error 1
make[3]: *** Waiting for unfinished jobs....
make[3]: Leaving directory `/var/tmp/portage/texinfo-4.7-r1/work/texinfo-4.7/inf
o'
make[2]: *** [all] Error 2
make[2]: Leaving directory `/var/tmp/portage/texinfo-4.7-r1/work/texinfo-4.7/inf
o'
make[1]: *** [all-recursive] Error 1
make[1]: Leaving directory `/var/tmp/portage/texinfo-4.7-r1/work/texinfo-4.7'
make: *** [all] Error 2
!!! ERROR: sys-apps/texinfo-4.7-r1 failed.
!!! Function src_compile, Line 54, Exitcode 2
!!! (no error message)
!!! If you need support, post the topmost build error, NOT this status message.
extreme root # |
|