Gentoo Forums
Gentoo Forums
Gentoo Forums
Quick Search: in
[SOLVED] Lxnay's Gentoo RR4 LiveCD Problem z sandbox
View unanswered posts
View posts from last 24 hours
View posts from last 7 days

 
Reply to topic    Gentoo Forums Forum Index Polskie forum (Polish)
View previous topic :: View next topic  
Author Message
zoozik
n00b
n00b


Joined: 16 May 2004
Posts: 32

PostPosted: Tue Apr 26, 2005 2:09 pm    Post subject: [SOLVED] Lxnay's Gentoo RR4 LiveCD Problem z sandbox Reply with quote

Witam!
Postanowilem zainstalowac gentoo uzywajac systemu plikow reiser4. Partycje zrobione, wszystko podmontowane, chroot zrobiony, lecz gdy wydaje polecenie
Code:
cd /usr/portage scripts/bootstrap.sh && env-update && source /etc/profile

Otrzymuje cos takiego:
Code:
 [[ (2/3) Updating portage ]]
Calculating dependencies ...done!
>>> emerge (1 of 2) sys-apps/sandbox-1.2.1-r2 to /
>>> md5 files   ;-) ChangeLog
>>> md5 files   ;-) metadata.xml
>>> md5 files   ;-) sandbox-1.2.1-r1.ebuild
>>> md5 files   ;-) sandbox-1.2.1-r2.ebuild
>>> md5 files   ;-) sandbox-1.2.1-r3.ebuild
>>> md5 files   ;-) sandbox-1.2.1.ebuild
>>> md5 files   ;-) sandbox-1.2.ebuild
>>> md5 files   ;-) files/digest-sandbox-1.2.1-r1
>>> md5 files   ;-) files/digest-sandbox-1.2.1-r2
>>> md5 files   ;-) files/digest-sandbox-1.2.1-r3
>>> md5 files   ;-) files/digest-sandbox-1.2.1
>>> md5 files   ;-) files/digest-sandbox-1.2
>>> md5 src_uri ;-) sandbox-1.2.1.tar.bz2
>>> Unpacking source...
>>> Unpacking sandbox-1.2.1.tar.bz2 to /var/tmp/portage/sandbox-1.2.1-r2/work
 * Removing useless C++ checks...                                         [ ok ]>>> Source unpacked.
./configure --prefix=/usr --host=i686-pc-linux-gnu --mandir=/usr/share/man --infodir=/usr/share/info --datadir=/usr/share --sysconfdir=/etc --localstatedir=/var/lib
configure: WARNING: If you wanted to set the --build type, don't use --host.
    If a cross compiler is detected then cross compile mode will be used.
checking for a BSD-compatible install... /bin/install -c
checking whether build environment is sane... yes
checking for gawk... gawk
checking whether make sets $(MAKE)... yes
checking for i686-pc-linux-gnu-strip... no
checking for strip... strip
checking for i686-pc-linux-gnu-gcc... no
checking for gcc... gcc
checking for C compiler default output file name... configure: error: C compiler cannot create executables
See `config.log' for more details.

!!! Please attach the config.log to your bug report:
!!! /var/tmp/portage/sandbox-1.2.1-r2/work/sandbox-1.2.1/config.log

!!! ERROR: sys-apps/sandbox-1.2.1-r2 failed.
!!! Function econf, Line 485, Exitcode 0
!!! econf failed

config.log
Code:
This file contains any messages produced by compilers while
running configure, to aid debugging if configure makes a mistake.

It was created by sandbox configure 1.2.1, which was
generated by GNU Autoconf 2.59.  Invocation command line was

  $ ./configure --prefix=/usr --host=i686-pc-linux-gnu --mandir=/usr/share/man --infodir=/usr/share/info --datadir=/usr/share --sysconfdir=/etc --localstatedir=/var/lib

## --------- ##
## Platform. ##
## --------- ##

hostname = lxnaycd
uname -m = i686
uname -r = 2.6.10-lxnay3
uname -s = Linux
uname -v = #2 Sat Feb 12 00:57:23 UTC 2005

/usr/bin/uname -p = AMD Athlon(tm) XP 1700+
/bin/uname -X     = unknown

/bin/arch              = unknown
/usr/bin/arch -k       = unknown
/usr/convex/getsysinfo = unknown
hostinfo               = unknown
/bin/machine           = unknown
/usr/bin/oslevel       = unknown
/bin/universe          = unknown

PATH: /sbin
PATH: /usr/sbin
PATH: /usr/lib/portage/bin
PATH: /bin
PATH: /usr/bin
PATH: /usr/local/bin
PATH: /opt/bin
PATH: /usr/i386-pc-linux-gnu/gcc-bin/3.3.5


## ----------- ##
## Core tests. ##
## ----------- ##

configure:1551: checking for a BSD-compatible install
configure:1606: result: /bin/install -c
configure:1617: checking whether build environment is sane
configure:1660: result: yes
configure:1717: checking for gawk
configure:1733: found /bin/gawk
configure:1743: result: gawk
configure:1753: checking whether make sets $(MAKE)
configure:1773: result: yes
configure:1852: checking for i686-pc-linux-gnu-strip
configure:1881: result: no
configure:1890: checking for strip
configure:1906: found /usr/bin/strip
configure:1917: result: strip
configure:1949: checking for i686-pc-linux-gnu-gcc
configure:1978: result: no
configure:1987: checking for gcc
configure:2003: found /usr/bin/gcc
configure:2013: result: gcc
configure:2257: checking for C compiler version
configure:2260: gcc --version </dev/null >&5
gcc (GCC) 3.3.5  (Gentoo Linux 3.3.5-r1, ssp-3.3.2-3, pie-8.7.7.1)
Copyright (C) 2003 Free Software Foundation, Inc.
This is free software; see the source for copying conditions.  There is NO
warranty; not even for MERCHANTABILITY or FITNESS FOR A PARTICULAR PURPOSE.

configure:2263: $? = 0
configure:2265: gcc -v </dev/null >&5
Reading specs from /usr/lib/gcc-lib/i386-pc-linux-gnu/3.3.5/specs
Configured with: /var/tmp/portage/gcc-3.3.5-r1/work/gcc-3.3.5/configure --enable-version-specific-runtime-libs --prefix=/usr --bindir=/usr/i386-pc-linux-gnu/gcc-bin/3.3.5 --includedir=/usr/lib/gcc-lib/i386-pc-linux-gnu/3.3.5/include --datadir=/usr/share/gcc-data/i386-pc-linux-gnu/3.3.5 --mandir=/usr/share/gcc-data/i386-pc-linux-gnu/3.3.5/man --infodir=/usr/share/gcc-data/i386-pc-linux-gnu/3.3.5/info --with-gxx-include-dir=/usr/lib/gcc-lib/i386-pc-linux-gnu/3.3.5/include/g++-v3 --host=i386-pc-linux-gnu --disable-altivec --disable-nls --enable-__cxa_atexit --enable-clocale=gnu --with-system-zlib --disable-checking --disable-werror --disable-libunwind-exceptions --enable-shared --enable-threads=posix --disable-multilib --disable-libgcj --enable-languages=c
Thread model: posix
gcc version 3.3.5  (Gentoo Linux 3.3.5-r1, ssp-3.3.2-3, pie-8.7.7.1)
configure:2268: $? = 0
configure:2270: gcc -V </dev/null >&5
gcc: `-V' option must have argument
configure:2273: $? = 1
configure:2296: checking for C compiler default output file name
configure:2299: gcc -O2 march=athlon-xp -fomit-frame-pointer -ftracer -fforce-addr -ffast-math -pipe -s   conftest.c  >&5
gcc: march=athlon-xp: No such file or directory
configure:2302: $? = 1
configure: failed program was:
| /* confdefs.h.  */
|
| #define PACKAGE_NAME "sandbox"
| #define PACKAGE_TARNAME "sandbox"
| #define PACKAGE_VERSION "1.2.1"
| #define PACKAGE_STRING "sandbox 1.2.1"
| #define PACKAGE_BUGREPORT "dev-portage@gentoo.org"
| #define PACKAGE "sandbox"
| #define VERSION "1.2.1"
| /* end confdefs.h.  */
|
| int
| main ()
| {
|
|   ;
|   return 0;
| }
configure:2341: error: C compiler cannot create executables
See `config.log' for more details.

## ---------------- ##
## Cache variables. ##
## ---------------- ##

ac_cv_env_CC_set=
ac_cv_env_CC_value=
ac_cv_env_CFLAGS_set=set
ac_cv_env_CFLAGS_value='-O2 march=athlon-xp -fomit-frame-pointer -ftracer -fforce-addr -ffast-math -pipe -s'
ac_cv_env_CPPFLAGS_set=
ac_cv_env_CPPFLAGS_value=
ac_cv_env_CPP_set=
ac_cv_env_CPP_value=
ac_cv_env_CXXCPP_set=
ac_cv_env_CXXCPP_value=
ac_cv_env_CXXFLAGS_set=set
ac_cv_env_CXXFLAGS_value='-O2 -march=athlon-xp -ftracer -fforce-addr -ffast-math -pipe -s'
ac_cv_env_CXX_set=
ac_cv_env_CXX_value=
ac_cv_env_F77_set=
ac_cv_env_F77_value=
ac_cv_env_FFLAGS_set=
ac_cv_env_FFLAGS_value=
ac_cv_env_LDFLAGS_set=
ac_cv_env_LDFLAGS_value=
ac_cv_env_build_alias_set=
ac_cv_env_build_alias_value=
ac_cv_env_host_alias_set=set
ac_cv_env_host_alias_value=i686-pc-linux-gnu
ac_cv_env_target_alias_set=
ac_cv_env_target_alias_value=
ac_cv_path_install='/bin/install -c'
ac_cv_prog_AWK=gawk
ac_cv_prog_ac_ct_CC=gcc
ac_cv_prog_ac_ct_STRIP=strip
ac_cv_prog_make_make_set=yes

## ----------------- ##
## Output variables. ##
## ----------------- ##

ACLOCAL='${SHELL} /var/tmp/portage/sandbox-1.2.1-r2/work/sandbox-1.2.1/missing --run aclocal-1.8'
ALLOCA=''
AMDEPBACKSLASH=''
AMDEP_FALSE=''
AMDEP_TRUE=''
AMTAR='${SHELL} /var/tmp/portage/sandbox-1.2.1-r2/work/sandbox-1.2.1/missing --run tar'
AR=''
AUTOCONF='${SHELL} /var/tmp/portage/sandbox-1.2.1-r2/work/sandbox-1.2.1/missing --run autoconf'
AUTOHEADER='${SHELL} /var/tmp/portage/sandbox-1.2.1-r2/work/sandbox-1.2.1/missing --run autoheader'
AUTOMAKE='${SHELL} /var/tmp/portage/sandbox-1.2.1-r2/work/sandbox-1.2.1/missing --run automake-1.8'
AWK='gawk'
CC='gcc'
CCDEPMODE=''
CFLAGS='-O2 march=athlon-xp -fomit-frame-pointer -ftracer -fforce-addr -ffast-math -pipe -s'
CPP=''
CPPFLAGS=''
CXX=''
CXXCPP=''
CXXDEPMODE=''
CXXFLAGS='-O2 -march=athlon-xp -ftracer -fforce-addr -ffast-math -pipe -s'
CYGPATH_W='echo'
DEFS=''
DEPDIR=''
ECHO='echo'
ECHO_C=''
ECHO_N='-n'
ECHO_T=''
EGREP=''
EXEEXT=''
F77=''
FFLAGS=''
INSTALL_DATA='${INSTALL} -m 644'
INSTALL_PROGRAM='${INSTALL}'
INSTALL_SCRIPT='${INSTALL}'
INSTALL_STRIP_PROGRAM='${SHELL} $(install_sh) -c -s'
LDFLAGS=''
LIBC_PATH=''
LIBC_VERSION=''
LIBOBJS=''
LIBS=''
LIBTOOL=''
LN_S=''
LTLIBOBJS=''
MAKEINFO='${SHELL} /var/tmp/portage/sandbox-1.2.1-r2/work/sandbox-1.2.1/missing --run makeinfo'
OBJEXT=''
PACKAGE='sandbox'
PACKAGE_BUGREPORT='dev-portage@gentoo.org'
PACKAGE_NAME='sandbox'
PACKAGE_STRING='sandbox 1.2.1'
PACKAGE_TARNAME='sandbox'
PACKAGE_VERSION='1.2.1'
PATH_SEPARATOR=':'
RANLIB=''
SET_MAKE=''
SHELL='/bin/sh'
STRIP='strip'
VERSION='1.2.1'
ac_ct_AR=''
ac_ct_CC='gcc'
ac_ct_CXX=''
ac_ct_F77=''
ac_ct_RANLIB=''
ac_ct_STRIP='strip'
am__fastdepCC_FALSE=''
am__fastdepCC_TRUE=''
am__fastdepCXX_FALSE=''
am__fastdepCXX_TRUE=''
am__include=''
am__leading_dot='.'
am__quote=''
bindir='${exec_prefix}/bin'
build=''
build_alias=''
build_cpu=''
build_os=''
build_vendor=''
datadir='/usr/share'
exec_prefix='NONE'
host='i686-pc-linux-gnu'
host_alias='i686-pc-linux-gnu'
host_cpu=''
host_os=''
host_vendor=''
includedir='${prefix}/include'
infodir='/usr/share/info'
install_sh='/var/tmp/portage/sandbox-1.2.1-r2/work/sandbox-1.2.1/install-sh'
libdir='${exec_prefix}/lib'
libexecdir='${exec_prefix}/libexec'
localstatedir='/var/lib'
mandir='/usr/share/man'
mkdir_p='mkdir -p -- .'
oldincludedir='/usr/include'
prefix='/usr'
program_transform_name='s,x,x,'
sbindir='${exec_prefix}/sbin'
sharedstatedir='${prefix}/com'
sysconfdir='/etc'
target_alias=''

## ----------- ##
## confdefs.h. ##
## ----------- ##

#define PACKAGE "sandbox"
#define PACKAGE_BUGREPORT "dev-portage@gentoo.org"
#define PACKAGE_NAME "sandbox"
#define PACKAGE_STRING "sandbox 1.2.1"
#define PACKAGE_TARNAME "sandbox"
#define PACKAGE_VERSION "1.2.1"
#define VERSION "1.2.1"

configure: exit 77


Ktos zna rozwiazanie tego problemu?
Z gory dziekuje za pomoc


Last edited by zoozik on Tue Apr 26, 2005 2:28 pm; edited 1 time in total
Back to top
View user's profile Send private message
Poe
Bodhisattva
Bodhisattva


Joined: 03 Apr 2004
Posts: 2155
Location: Mysłowice/Lublin, Poland

PostPosted: Tue Apr 26, 2005 2:15 pm    Post subject: Reply with quote

https://forums.gentoo.org/viewtopic-t-247801-highlight-compiler+executables.html
_________________
Hardware:HP Pavilion DV6875SE[C2DT5550@1.83GHz_3GB-DDR2_320GB-SATA_GF8400GS]
http://popularcoffee.blogspot.com - Popkulturowa Kawa
RLU#342333
Back to top
View user's profile Send private message
milu
Bodhisattva
Bodhisattva


Joined: 03 May 2004
Posts: 1122
Location: Poland, Konstancin-Jeziorna

PostPosted: Tue Apr 26, 2005 2:16 pm    Post subject: Reply with quote

Code:
checking for C compiler default output file name... configure: error: C compiler cannot create executables


poszukaj po forum - było tyle razy...

arsen, nelchael: lock?
_________________
Pozdrawiam,
Milu
------------------------------------
Registered Linux User: #246079

Zanim zadasz pytanie przeczytaj to dokładnie!!
Back to top
View user's profile Send private message
zoozik
n00b
n00b


Joined: 16 May 2004
Posts: 32

PostPosted: Tue Apr 26, 2005 2:28 pm    Post subject: Reply with quote

Faktycznie... blad byl idiotyczny - jak zmienialem flagi w jednym miejscu zapomnialem o myslniku...
Back to top
View user's profile Send private message
Display posts from previous:   
Reply to topic    Gentoo Forums Forum Index Polskie forum (Polish) All times are GMT
Page 1 of 1

 
Jump to:  
You cannot post new topics in this forum
You cannot reply to topics in this forum
You cannot edit your posts in this forum
You cannot delete your posts in this forum
You cannot vote in polls in this forum